{"text_format":"1","workbook":"xlsx","n_sheets":2,"sheets":["Нарушения (Город)","ahistory_our"],"not_rendered":{"charts":0,"images":0,"macros":1,"external_links":0,"defined_names":2,"comments":0,"pivot_tables":0},"unopened":[],"bounds":{"document_bytes":16777216,"sheet_cells":100000,"rows_first":2000,"rows_last":500,"rows_between":2000,"halvings":0,"cell_chars":16384,"cell_head_chars":4096},"cells_cut":0,"cells_raw":0,"read":"whole","date_system":"1900"}

{"sheet":"Нарушения (Город)","index":0,"n_rows":19,"n_cols":7,"rows_kept":19,"cut":false,"hidden":false,"merged":[]}
["Номер","Марка","Парк","Время нарушения","км/ч","Текст нарушения","Водитель"]
["в083хв","(Окт-я)","Куп","2016-06-15T16:44:55",93,"в083хв-Куп(Окт-я) нарушил скоростной режим (Город). 2016-06-16 15:44:09 он двигался со скоростью 93 км/ч около 'Россия, Санкт-Петербург, Бухарестская ул.'.",{"$f":"LOOKUP(1,1/(($D2>=ahistory_our!$D$2:$D$22)*($D2<=ahistory_our!$E$2:$E$22)*(UPPER(A2)=ahistory_our!$A$2:$A$22)),ahistory_our!$B$2:$B$22)","v":"Радкевич Андрей Николаевич"}]
["в083хв","(Окт-я)","Куп","2016-06-16T15:58:05",93,"в083хв-Куп(Окт-я) нарушил скоростной режим (Город). 2016-06-16 15:58:11 он двигался со скоростью 93 км/ч около 'Россия, Санкт-Петербург, Бухарестская ул.'.",{"$f":"LOOKUP(1,1/(($D3>=ahistory_our!$D$2:$D$22)*($D3<=ahistory_our!$E$2:$E$22)*(UPPER(A3)=ahistory_our!$A$2:$A$22)),ahistory_our!$B$2:$B$22)","v":"Полетаев Александр Николаевич"}]
["в083хв","(Окт-я)","Куп","2016-06-16T23:07:39",93,"в083хв-Куп(Окт-я) нарушил скоростной режим (Город). 2016-06-16 23:07:42 он двигался со скоростью 93 км/ч около 'Россия, Санкт-Петербург, Народного Ополчения пр.'.",{"$f":"LOOKUP(1,1/(($D4>=ahistory_our!$D$2:$D$22)*($D4<=ahistory_our!$E$2:$E$22)*(UPPER(A4)=ahistory_our!$A$2:$A$22)),ahistory_our!$B$2:$B$22)","v":"Полетаев Александр Николаевич"}]
["в083хв","(Окт-я)","Куп","2016-06-16T23:45:48",91,"в083хв-Куп(Окт-я) нарушил скоростной режим (Город). 2016-06-16 23:45:51 он двигался со скоростью 91 км/ч около 'Россия, Санкт-Петербург, Путепровод Нева'.",{"$f":"LOOKUP(1,1/(($D5>=ahistory_our!$D$2:$D$22)*($D5<=ahistory_our!$E$2:$E$22)*(UPPER(A5)=ahistory_our!$A$2:$A$22)),ahistory_our!$B$2:$B$22)","v":"Полетаев Александр Николаевич"}]
["в086ту","(Джетта)","Лиг","2016-06-16T19:14:38",94,"в086ту-Лиг(Джетта) нарушил скоростной режим (Город). 2016-06-16 19:14:38 он двигался со скоростью 94 км/ч около 'Россия, Санкт-Петербург, Маршала Жукова пр.'.",{"$f":"LOOKUP(1,1/(($D6>=ahistory_our!$D$2:$D$22)*($D6<=ahistory_our!$E$2:$E$22)*(UPPER(A6)=ahistory_our!$A$2:$A$22)),ahistory_our!$B$2:$B$22)","v":"Афанасьева Ольга Андреевна"}]
["в086ту","(Джетта)","Лиг","2016-06-16T23:48:18",91,"в086ту-Лиг(Джетта) нарушил скоростной режим (Город). 2016-06-16 23:48:18 он двигался со скоростью 91 км/ч около 'Россия, 41К011 Стрельнинское шоссе, Старые Заводы'.",{"$f":"LOOKUP(1,1/(($D7>=ahistory_our!$D$2:$D$22)*($D7<=ahistory_our!$E$2:$E$22)*(UPPER(A7)=ahistory_our!$A$2:$A$22)),ahistory_our!$B$2:$B$22)","v":"Афанасьева Ольга Андреевна"}]
["в099ту","(Джетта)","Лит","2016-06-16T10:23:36",96,"в099ту-Лит(Джетта) нарушил скоростной режим (Город). 2016-06-16 10:23:40 он двигался со скоростью 96 км/ч около 'Россия, Санкт-Петербург, Шафировский пр.'.",{"$f":"LOOKUP(1,1/(($D8>=ahistory_our!$D$2:$D$22)*($D8<=ahistory_our!$E$2:$E$22)*(UPPER(A8)=ahistory_our!$A$2:$A$22)),ahistory_our!$B$2:$B$22)","v":"Яковлев Сергей Валерьевич"}]
["в099ту","(Джетта)","Лит","2016-06-16T10:25:23",92,"в099ту-Лит(Джетта) нарушил скоростной режим (Город). 2016-06-16 10:25:54 он двигался со скоростью 92 км/ч около 'Россия, Санкт-Петербург, Шафировский пр.'.",{"$f":"LOOKUP(1,1/(($D9>=ahistory_our!$D$2:$D$22)*($D9<=ahistory_our!$E$2:$E$22)*(UPPER(A9)=ahistory_our!$A$2:$A$22)),ahistory_our!$B$2:$B$22)","v":"Яковлев Сергей Валерьевич"}]
["в099ту","(Джетта)","Лит","2016-06-16T10:54:32",94,"в099ту-Лит(Джетта) нарушил скоростной режим (Город). 2016-06-16 10:54:34 он двигался со скоростью 94 км/ч около 'Россия, Санкт-Петербург, Полюстровский пр.'.",{"$f":"LOOKUP(1,1/(($D10>=ahistory_our!$D$2:$D$22)*($D10<=ahistory_our!$E$2:$E$22)*(UPPER(A10)=ahistory_our!$A$2:$A$22)),ahistory_our!$B$2:$B$22)","v":"Яковлев Сергей Валерьевич"}]
["в100ту","(Джетта)","Лит","2016-06-16T00:01:32",92,"в100ту-Лит(Джетта) нарушил скоростной режим (Город). 2016-06-16 00:01:33 он двигался со скоростью 92 км/ч около 'Россия, Американский мост, Санкт-Петербург'.",{"$f":"LOOKUP(1,1/(($D11>=ahistory_our!$D$2:$D$22)*($D11<=ahistory_our!$E$2:$E$22)*(UPPER(A11)=ahistory_our!$A$2:$A$22)),ahistory_our!$B$2:$B$22)","v":"Коновалов Юрий Васильевич"}]
["в100ту","(Джетта)","Лит","2016-06-16T02:34:24",95,"в100ту-Лит(Джетта) нарушил скоростной режим (Город). 2016-06-16 02:34:25 он двигался со скоростью 95 км/ч около 'Россия, Санкт-Петербург, Софийская ул.'.",{"$f":"LOOKUP(1,1/(($D12>=ahistory_our!$D$2:$D$22)*($D12<=ahistory_our!$E$2:$E$22)*(UPPER(A12)=ahistory_our!$A$2:$A$22)),ahistory_our!$B$2:$B$22)","v":"Коновалов Юрий Васильевич"}]
["в100ту","(Джетта)","Лит","2016-06-16T21:21:23",91,"в100ту-Лит(Джетта) нарушил скоростной режим (Город). 2016-06-16 14:21:23 он двигался со скоростью 91 км/ч около 'Россия, Санкт-Петербург, Шафировский пр.'.",{"$f":"LOOKUP(1,1/(($D13>=ahistory_our!$D$2:$D$22)*($D13<=ahistory_our!$E$2:$E$22)*(UPPER(A13)=ahistory_our!$A$2:$A$22)),ahistory_our!$B$2:$B$22)","v":"Новиков Андрей Викторович"}]
["в100ту","(Джетта)","Лит","2016-06-17T21:21:23",92,null,{"$f":"LOOKUP(1,1/(($D14>=ahistory_our!$D$2:$D$22)*($D14<=ahistory_our!$E$2:$E$22)*(UPPER(A14)=ahistory_our!$A$2:$A$22)),ahistory_our!$B$2:$B$22)","v":"Коновалов Юрий Васильевич"}]
["в100ту","(Джетта)","Лит","2016-06-18T21:21:23",93,null,{"$f":"LOOKUP(1,1/(($D15>=ahistory_our!$D$2:$D$22)*($D15<=ahistory_our!$E$2:$E$22)*(UPPER(A15)=ahistory_our!$A$2:$A$22)),ahistory_our!$B$2:$B$22)","v":"Новиков Андрей Викторович"}]
["в100ту","(Джетта)","Лит","2016-06-16T10:23:36",94,null,{"$f":"LOOKUP(1,1/(($D16>=ahistory_our!$D$2:$D$22)*($D16<=ahistory_our!$E$2:$E$22)*(UPPER(A16)=ahistory_our!$A$2:$A$22)),ahistory_our!$B$2:$B$22)","v":"Коновалов Юрий Васильевич"}]
["в100ту","(Джетта)","Лит","2016-06-16T10:25:23",95,null,{"$f":"LOOKUP(1,1/(($D17>=ahistory_our!$D$2:$D$22)*($D17<=ahistory_our!$E$2:$E$22)*(UPPER(A17)=ahistory_our!$A$2:$A$22)),ahistory_our!$B$2:$B$22)","v":"Коновалов Юрий Васильевич"}]
["в100ту","(Джетта)","Лит","2016-06-16T10:54:32",96,null,{"$f":"LOOKUP(1,1/(($D18>=ahistory_our!$D$2:$D$22)*($D18<=ahistory_our!$E$2:$E$22)*(UPPER(A18)=ahistory_our!$A$2:$A$22)),ahistory_our!$B$2:$B$22)","v":"Коновалов Юрий Васильевич"}]
["в100ту","(Джетта)","Лит","2016-06-22T21:21:23",97,null,{"$f":"LOOKUP(1,1/(($D19>=ahistory_our!$D$2:$D$22)*($D19<=ahistory_our!$E$2:$E$22)*(UPPER(A19)=ahistory_our!$A$2:$A$22)),ahistory_our!$B$2:$B$22)","v":{"$error":"#N/A"}}]

{"sheet":"ahistory_our","index":1,"n_rows":22,"n_cols":5,"rows_kept":22,"cut":false,"hidden":false,"merged":[]}
["Номер","Телефон","Парк","Дата с","Дата по"]
["В083ХВ","Пахомов Игорь Ильич",5,"2016-06-18T11:13:33"]
["В083ХВ","Воропаев Сергей Константинович",5,"2016-06-17T14:16:11","2016-06-18T11:13:27"]
["В083ХВ","Полетаев Александр Николаевич",5,"2016-06-16T14:29:02","2016-06-17T14:09:54"]
["В083ХВ","Радкевич Андрей Николаевич",5,"2016-06-15T13:19:13","2016-06-16T14:28:53"]
["В083ХВ","Безик Алексей Константинович",5,"2016-06-14T18:50:58","2016-06-15T12:55:00"]
["В086ТУ","Игнатьев Герман Викторович",7,"2016-06-18T12:40:03"]
["В086ТУ","Шумарин Игорь Иванович",5,"2016-06-17T21:35:27","2016-06-18T12:39:49"]
["В086ТУ","Афанасьева Ольга Андреевна",7,"2016-06-16T12:53:51","2016-06-17T13:29:22"]
["В086ТУ","Игнатьев Герман Викторович",7,"2016-06-15T13:36:53","2016-06-16T12:53:29"]
["В086ТУ","Игнатьев Герман Викторович",7,"2016-06-14T14:30:30","2016-06-15T13:15:53"]
["В099ТУ","Васильев Андрей Владимиpович",2,"2016-06-18T16:33:12"]
["В099ТУ","Васильев Андрей Дмитриевич",4,"2016-06-18T16:32:58","2016-06-18T16:33:02"]
["В099ТУ","Яковлев Сергей Валерьевич",2,"2016-06-17T12:11:49","2016-06-18T11:58:48"]
["В099ТУ","Яковлев Сергей Валерьевич",2,"2016-06-16T11:19:24","2016-06-17T12:11:38"]
["В099ТУ","Яковлев Сергей Валерьевич",2,"2016-06-15T12:17:48","2016-06-16T11:19:13"]
["В099ТУ","Яковлев Сергей Валерьевич",2,"2016-06-14T12:19:35","2016-06-15T12:17:40"]
["В100ТУ","Коновалов Юрий Васильевич",2,"2016-06-18T18:56:55"]
["В100ТУ","Коновалов Юрий Васильевич",2,"2016-06-17T15:06:47","2016-06-18T18:56:40"]
["В100ТУ","Новиков Андрей Викторович",2,"2016-06-16T15:35:16","2016-06-17T15:06:41"]
["В100ТУ","Коновалов Юрий Васильевич",2,"2016-06-15T15:09:15","2016-06-16T15:12:30"]
["В100ТУ","Новиков Андрей Викторович",2,"2016-06-17T14:35:42","2016-06-19T14:41:27"]